{"text_format":"1","workbook":"xlsx","n_sheets":8,"sheets":["Read me first","Search Indicators","Working sheet","P-S-I functions - Summary","Indicators list - Full","Impacts matrix full","Model outputs","Comments"],"not_rendered":{"charts":0,"images":10,"macros":1,"external_links":0,"defined_names":11,"comments":2,"pivot_tables":0},"unopened":[],"bounds":{"document_bytes":16777216,"sheet_cells":100000,"rows_first":2000,"rows_last":500,"rows_between":2000,"halvings":0,"cell_chars":16384,"cell_head_chars":4096},"cells_cut":0,"cells_raw":0,"read":"whole","date_system":"1900"}

{"sheet":"Read me first","index":0,"n_rows":23,"n_cols":4,"rows_kept":23,"cut":false,"hidden":false,"merged":[[8,2,8,3],[9,2,9,3],[1,1,2,6],[5,2,5,3],[6,2,6,3],[7,2,7,3]]}
[null,"N-MIP: Nitrogen Matrix of Impacts and Pressures - developed by the INMS A1.2"]
[null,"This matrix is developed as a background materials for the guidance document of the nitrogen impact assessment methodology, a product of the Activity 1.2 in the Towards INMS project (UNEP/GEF). The DPSIR (Drivers, Pressures, States, Impacts and Response) framework is applied to defined the indicators and their connections.  Last update: March 2022."]
[]
[]
[]
[null,"Sheet tab","Contents"]
[null,"Search Indicators","Searchable tool of the various information and indicators  "]
[null,"P-S-I functions -Summary","Summary table of Pressure - State - Impact functions"]
{"$rows_left_out":16}
{"sheet":"Search Indicators","index":1,"n_rows":23,"n_cols":12,"rows_kept":23,"cut":false,"hidden":false,"merged":[[3,11,6,11],[3,8,8,9],[15,1,16,1],[17,1,18,1],[3,5,7,6],[10,1,13,1],[5,1,6,1],[14,5,17,6],[13,8,18,9],[19,5,22,6],[21,0,22,0],[9,5,12,6],[19,1,20,1],[21,8,22,11],[11,11,12,11],[14,11,15,11],[17,11,18,11]]}
[]
[null,"Select impact",null,"Pressure indicators",null,"State indicators",null,null,"Impact indicators",null,null,"Economic valuation"]
[null,null,null,null,null,"Air",null,null,null,null,null,"Endpoints category"]
["Category: ",null,null,{"$f":"IF($B$6=\"\",\" \",IF(VLOOKUP($B$6,'Impacts matrix full'!$B$4:$DU$41,33,FALSE)=\"x\",'Impacts matrix full'!$AH$4,\" \"))","v":" "},null,{"$f":"IF($B$6=\"\",\" \",IF(VLOOKUP($B$6,'Impacts matrix full'!$B$4:$DU$41,43,FALSE)=\"x\",VLOOKUP($B$6,'Impacts matrix full'!$B$4:$DU$41,42,FALSE),\" \"))","v":" "},null,null,{"$f":"IF($B$6=\"\",\" \", VLOOKUP($B$6,'Impacts matrix full'!$B$4:$DU$41,88,FALSE))","v":" "},null,null,{"$f":"IF($B$6=\"\",\" \", VLOOKUP($B$6,'Impacts matrix full'!$B$4:$DU$41,110,FALSE))","v":" "}]
[null,null,null,{"$f":"IF($B$6=\"\",\" \", IF(VLOOKUP($B$6,'Impacts matrix full'!$B$4:$DU$41,34,FALSE)=\"x\",'Impacts matrix full'!$AI$4, \" \"))","v":" "}]
["Impact:",null,null,{"$f":"IF($B$6=\"\",\" \", IF(VLOOKUP($B$6,'Impacts matrix full'!$B$4:$DU$41,35,FALSE)=\"x\",'Impacts matrix full'!$AJ$4, \" \"))","v":" "}]
[null,null,null,{"$f":"IF($B$6=\"\",\" \", IF(VLOOKUP($B$6,'Impacts matrix full'!$B$4:$DU$41,36,FALSE)=\"x\",'Impacts matrix full'!$AK$4, \" \"))","v":" "}]
[null,null,null,{"$f":"IF($B$6=\"\",\" \", IF(VLOOKUP($B$6,'Impacts matrix full'!$B$4:$DU$41,37,FALSE)=\"x\",'Impacts matrix full'!$AL$4, \" \"))","v":" "}]
{"$rows_left_out":16}
{"sheet":"Working sheet","index":2,"n_rows":10,"n_cols":8,"rows_kept":10,"cut":false,"hidden":true,"merged":[]}
[null,"Human_health","Greenhouse_gas_balance","Terrestrial_Ecosystem","Aquatic_Ecosystem","Agricultural_production","Cultural_services","Non_agricultural_products"]
[null,"Respiratory disease by aerosols","Climate cooling by aerosol","Biodiversity loss - aboveground","Increased fish and aquatic production","Ozone and aerosol damage to crops","Damage to food quality ","Industrial N products"]
[null,"Respiratory disease from NOx","Climate cooling by CH4 uptake","Effects on belowground communities","Eutrophication in marine and coastal environments","Increase of wood production from N deposition","Haze"]
[null,"Increase risk of cancer/cataracts","Global warming by N2O","Acidification of ecosystems, soil and water","Eutrophication in freshwater","Increase of crop yield from N fertilizer","Structural damages  "]
[null,"Drinking water contamination","Global warming by O3","Soil N enrichment","Hypoxia/anoxia damage to fisheries","Increase of crop yield from N deposition","Odor"]
[null,"Damage to food quality ",null,"Ozone and aerosol damage to ecosystem","Acidification of ecosystems, soil and water","Increased bio-energy from N fertilizer"]
[null,"Overconsumption of carbohydrates and meats",null,"Enhanced C sink","Ocean CO2 emission","Increased bio-energy from atmospheric N deposition"]
[null,"Skin irritant and toxins",null,"Biodiversity protection",null,"Reduced agricultural productivity"]
{"$rows_left_out":3}
{"sheet":"P-S-I functions - Summary","index":3,"n_rows":16,"n_cols":8,"rows_kept":16,"cut":false,"hidden":false,"merged":[]}
["Category icon","Category","Impact Description","Pressure to State Pathway","State Indicators","Impact indicator    (+/-) ","State to Impact function","Spatial and temporal scale of impact"]
[null,"HUMAN HEALTH","Respiratory disease, cancers from NOx, O3, PM ","NH3, NOx emissions","NOx, NH3-> O3, PM in troposphere","Incidence of respiratory disease  (-)",null,"Local to regional/years"]
[null,"HUMAN HEALTH","Health issues from drinking water contamination ","NO3 leaching","NO3 in surface and groundwater","Incidence of birth defects and cancers (-)",null,"Local to regional/years"]
[null,"HUMAN HEALTH","Wheat intolerance, allergies to gluten","Mineral and organic N fertilizer application to wheat","Gliadin, a storage protein","Coeliac disease",null,"Regional to global/years"]
[null,"HUMAN HEALTH","Disease associated with high protein and carbohydrate  consumption ","Mineral and organic N fertilizer application","Crop Yield/Livestock production/animal and caloric consumption","Incidence of diet-associated cancers, liver,  and  heart disease*",null,"Global/years"]
[null,"AQUATIC ECOSYSTEMS","Fish yields","NO3 leaching","NO3 in surface water ->algal biomass","Fish catch (+/-)",null,"Local to regional/Seasons to years"]
[null,"AQUATIC ECOSYSTEMS","Freshwater eutrophication","NO3 leaching","NO3 -> O2, cyanotoxin, algal biomass","Biodiversity (-)",null,"Local to regional/seasons to years"]
[null,"AQUATIC ECOSYSTEMS","Freshwater eutrophication","NO3 leaching","NO3 -> O2, cyanotoxin, algal biomass","Harmful Algal Blooms (-)",null,"Local to regional/seasons to years"]
{"$rows_left_out":9}
{"sheet":"Indicators list - Full","index":4,"n_rows":33,"n_cols":12,"rows_kept":33,"cut":false,"hidden":false,"merged":[[3,11,14,15],[19,3,19,6],[2,8,2,9],[2,3,2,6],[7,3,7,6],[15,3,15,6]]}
[null,"Pressures indicators",null,"States indicators",null,null,null,null,"Impacts indicators",null,null,"Tracking indicators"]
[]
[null,"Emission to atmosphere ",null,"Air",null,null,null,null,"Human health"]
[null,"N2O emission (kgN2O/year)",null,"NOx (ppbv) ","HNO3 (ppbv) ","NH3 (ppbv)","Acidity (pH in rainwater)",null,"Harmful algal bloom (HABs) (mg/L of Cyanobacteria)","Premature death (number of premature death)",null,"- Nitrogen Use Efficiency (NUE, %)\n- Nitrogen footprint (kgN/capita/year)\n- Input-output N budget (kgN/ha/year)\n- Exceedance of critical load of atmospheric N deposition (kgN/ha/year)\n- Exceedance of critical level of NH3 emission (μg m⁻³)\n- Exceedance of critical N inputs to farmland (kgN/ha/year)\n- Nitrogen loss from soil during dormant season (kgN/ha/month)\n- Exceedance of critical level/ratios of N, P, Si in water (mg/L, Relative value)\n- % people exposed to > threshold (%)\n- Increased incidence of disease (number of patients)"]
[null,"NOx emission (kgNOx/year)",null,"N2O (ppbv)","CO2 (ppmv)","CH4 (ppbv)","O3 (ppbv)",null,"Production rates of food, fiber and fuel (kg/year)"]
[null,"NH3 emission (kgNH3/year)",null,"PM (ppbv)","Org-N (ppbv)","Volatilized org-N (VON) (ppbv)","Peroxyacetyl Nitrate (PAN) (ppbv)"]
[null,null,null,null,null,null,null,null,"Human health & Cultural services"]
[null,"Atmospheric  deposition",null,"Land",null,null,null,null,"Disability-Adjusted Life Years (years)"]
{"$rows_left_out":26}
{"sheet":"Impacts matrix full","index":5,"n_rows":44,"n_cols":141,"rows_kept":44,"cut":false,"hidden":false,"merged":[]}
[null,"Description","Description","Description","Mechanisms","Mechanisms","Mechanisms","Threats","Benefits","Category","Category","Category","Category","Category","Category","Category","Category","Category","Category","Category","Category","Category","Category","Category","Category","Category","Category","Pressures","Pressures","Pressures","Pressures","Pressures","Pressures","Pressures","Pressures","Pressures","Pressures","Pressures","Pressures","Pressures","Pressures","Pressures","States",null,null,null,null,"States","States","States","States","States","States","States","States","States","States","States","States","States","States","States","States","States","States","States","States","States","States","States","States","States","States","States","States","States","States","States","States","States","States","States","States","States","States","States","States","States","Impacts","Impacts","Impacts","Impacts","Impacts","Impacts","Impacts","Impacts","Impacts","Impacts","Impacts","Impacts","Impacts","Impacts","Impacts","Impacts","Impacts","Impacts","Impacts","Impacts","Impacts","Impacts","Endpoints","Endpoints","Endpoints","Endpoints","Endpoints","Endpoints","Endpoints","Endpoints","Endpoints","Endpoints","Endpoints","Modelling","Modelling","Modelling","Modelling","Tracking","Tracking","Tracking","Tracking","Tracking","Tracking","Tracking","Tracking","Tracking","Tracking","Tracking","Thresholds","Thresholds","Thresholds","Thresholds","Thresholds"]
[null,"Common","Common","Common","Common","Common","Common","Common","Common","A1.2","A1.2","A1.2","A1.2","A1.2","A1.2","A1.2","A1.4","A1.4","A1.4","WAGES-FE ","WAGES-FE ","WAGES-FE ","WAGES-FE ","WAGES-FE ","WAGES-FE ","WAGES-FE ","WAGES-FE ","A1.3","A1.3","A1.3","A1.3","A1.3","A1.3","A1.3","A1.3","A1.3","A1.3","A1.3","A1.3","A1.3","A1.3","A1.3","A1.1/A1.3",null,null,null,null,"A1.1/A1.3","A1.1/A1.3","A1.1/A1.3","A1.1/A1.3","A1.1/A1.3","A1.1/A1.3","A1.1/A1.3","A1.1/A1.3","A1.1/A1.3","A1.1/A1.3","A1.1/A1.3","A1.1/A1.3","A1.1/A1.3","A1.1/A1.3","A1.1/A1.3","A1.1/A1.3","A1.1/A1.3","A1.1/A1.3","A1.1/A1.3","A1.1/A1.3","A1.1/A1.3","A1.1/A1.3","A1.1/A1.3","A1.1/A1.3","A1.1/A1.3","A1.1/A1.3","A1.1/A1.3","A1.1/A1.3","A1.1/A1.3","A1.1/A1.3","A1.1/A1.3","A1.1/A1.3","A1.1/A1.3","A1.1/A1.3","A1.1/A1.3","A1.1/A1.3","A1.1/A1.3","A1.1/A1.3","A1.1/A1.3","A1.1/A1.3","A1.1/A1.3","A1.2/1.4","A1.2/1.4","A1.2/1.4","A1.2/1.4","A1.2/1.4","A1.2/1.4","A1.2/1.4","A1.2/1.4","A1.2/1.4","A1.2/1.4","A1.2/1.4","A1.2/1.4","A1.2/1.4","A1.2/1.4","A1.2/1.4","A1.2/1.4","A1.2/1.4","A1.2/1.4","A1.2/1.4","A1.2/1.4","A1.2/1.4","A1.2/1.4","A1.4","A1.4","A1.4","A1.4","A1.4","A1.4","A1.4","A1.4","A1.4","A1.4","A1.4","A1.5/A2.1","A1.5/A2.1","A1.5/A2.1","A1.5/A2.1"]
[null,null,null,null,null,null,null,null,null,null,null,null,null,null,null,null,null,null,null,null,null,null,null,null,null,null,null,null,null,null,null,null,null,"Inputs to water","Inputs to water","Inputs to water","Atmospheric deposition","Emission to atmosphere","Emission to atmosphere","Emission to atmosphere","Fertilizer","Material",null,"State category","State category","Sate category","Sate category","Land","Land","Land","Land","Land","Land","Land","Air","Land","Air","Air","Air","Air","Air","Air","Air","Air","Air","Air","Air","Air","Air","Air","Water","Water","Water","Water","Water","Water","Water","Water","Land","Land","Land","Land","Land","Land","Land","Land","Land",null,null,"Aquatic Ecosystem","Aquatic Ecosystem","Aquatic Ecosystem","Human health","Terrestrial Ecosystem/Agricultural productions/Aquatic Ecosystem","Terrestrial Ecosystem","Terrestrial Ecosystem","Terrestrial Ecosystem","Agricultural productions","Agricultural productions","Societal values","Agricultural productions","Terrestrial Ecosystem","Terrestrial Ecosystem/Greenhouse gas balance"," Human health/Societal values"," Human health","Societal values","Societal values","Societal values","Non-agricultural products","Human health"]
["ID","Impact \n-  short description","Impact \n- long description","Chapter of the A1.2 Guidance Document","Mechanism\nStep 1","Mechanism\nStep 2","Mechanism\nStep 3","Negative impacts","Positive impacts","Human health","Greenhouse gas balance","Terrestrial Ecosystem","Aquatic Ecosystem","Agricultural production","Cultural services","Non-agricultural products","Human health","Bio-diversity","Socio-cultural-economic-well-being","Water quality","Air quality","Greenhouse gas","Ecosystem & Biodiversity","Soil quality","Food","Energy","Other","Pressure indicator \n- Descriptions -","Emission to atmosphere ","Atmospheric  deposition","Inputs to terrestrial system ","Inputs to water bodies","Trade related flows ","N-runoff","NO3 leaching","NO2 leaching","N deposition","N2O emission","NOx emission","NH3 emission","N fertilizer","Manufactures N addition","State indicators\n- Full -","Air","Land","Water","Materials","Soil N availability","Soil pH","Soil N and C concentration, C/N ratio","Soil Al (and heavy metal) concentration","Plant N","Carbon stock in terrestrial ecosystems","NEP/NPP in terrestrial ecosystems","Plant Available N (PAN)","Animal N nutrition","N2O concentration in air","CO2 concentration in air","PM2.5 concentration in air","PM10 concentration in air","NOx concentration in air","HNO3 concentration in air","NH3 concentration in air","Particulate NH4 concentration in air","CH4 concentration in air","O3 concentration in air","Organic N (per-oxidized) concertation in air","VON concentration in air","Acidity in precipitation/particulate matter","O3 concentration in precipitation/troposphere","NH4 concentration in water","NO3 concentration in water","NO2 concentration in water","PO4 concentration in water","BOD in water","Dissolved O2 in water","Algal taxonomy","Chlorophyll A","POD1 (forest), POD6 (vegetation)","AOT40","W126","AFstY (O3 flux)","NO3 and NO2 in food","N content cereal","Protein content in food","Food quality index","Food N intake","N content in commodities","Impact indicator \n- All items -","Impact indicators \nFish yield","Impact indicators \nChlorophyll","Impact indicators \nMacrophytes Macrofauna","Impact indicators \nHABs","Impact indicators \nGrowth rate","Impact indicators \nLichen and moss","Impact indicators \nBiodiversity","Impact indicators \nSoil fauna","Impact indicators \nCrop yield","Impact indicators \nWood yield","Impact indicators \nEnergy yield","Impact indicators \nAnimal yield","Impact indicators \nLand-use change","Impact indicators \nGWP change","Impact indicators \nDisability-Adjusted Life Years","Impact indicators \nPremature death","Impact indicators \nWTP to prevent","Impact indicators \nNumber of haze days","Impact indicators \nCost of repairing","Impact Indicators Production rates of materials","Impact Indicators Production rates of food, fiber and fuel","Endpoints for economic valuation\n- Full - ","Human health impacts by ambient air pollution","Human health impacts by nitrate in drinking water","Human health impacts by others","Farm and food impacts","Impacts on GHG balance and climate","Impacts on terrestrial ecosystem","Impacts on freshwater ecosystems","Impacts on marine ecosystems","Ecosystem services","Others","Pressure-Impact modelling\n(global scale)","INMS A1.5 & 2.1 model for impact indicator","INMS A1.5 & 2.1 model for states indicator","INMS A1.5 & 2.1 model for driver/pressure","Performance indicators - full","NUE","N footprint","Input-output budget","Exceedance of critical load of atmospheric N deposition","Exceedance of critical level of NH3 emission","Exceedance of critical N inputs to farmland","N loss from soil during dormant season ","Exceedance of critical level/ratios of N, P, Si in water","% people exposed to > threshold","Increased incidence of disease","Threshold indicators - full","Critical Load of atmospheric N deposition","Critical level of NH3 emission","Critical input of fertilizer/manure to farmland","Critical level/ratios of N, P, Si in water"]
[1,"Increased fish and aquatic production","Increased primal productivity, aquatic biomass and/or fish production due to atmospheric N deposition and N runoff to water bodies","3.1.2","Increased available N in soils/waters","Increased plant growth","Increased animal production",null,"x",null,null,null,"x",null,null,null,"x",null,null,null,null,null,null,null,"x",null,null,"N-runoff |\nInputs to water bodies\nN deposition | \nAtmospheric deposition","x","x",null,"x",null,"x",null,null,"x",null,null,null,null,null,"NH4concentration,  \nNO3 concentration ",null,null,"x",null,null,null,null,null,null,null,null,null,null,null,null,null,null,null,null,null,null,null,null,null,null,null,null,"x","x",null,null,null,null,null,null,null,null,null,null,null,null,null,null,null,null,"Fish yield","x",null,null,null,null,null,null,null,null,null,null,null,null,null,null,null,null,null,null,null,null,"Farm and food impacts",null,null,null,"x",null,null,null,null,null,null,"N/A","NEMO-ERSEM","N/A","NEMO-ERSEM?","N/A",null,null,null,null,null,null,null,null,null,null,"N/A"]
[2,"Eutrophication in marine and coastal environments","Nutrient enrichment of marine and coastal environments leading to increased algal productivity, cyanobacterial toxins, hypoxia/anoxia and damage to biodiversity","3.1.2","Increased available N in waters","Increased plankton growth","Reduced light penetration / Reduced dissolved oxygen","x",null,null,null,null,"x",null,null,null,null,"x",null,"x",null,null,"x",null,null,null,null,"N-Runoff | \nInputs to water bodies\nN deposition | \nAtmospheric deposition",null,"x",null,"x",null,"x",null,null,"x",null,null,null,null,null,"BOD, \nNO3, \nDissolved O2, \nAlgal taxonomy\n",null,null,"x",null,null,null,null,null,null,null,null,null,null,null,null,null,null,null,null,null,null,null,null,null,null,null,null,null,"x",null,null,"x","x","x",null,null,null,null,null,null,null,null,null,null,null,"Chlorophyll, \nMacrophytes,  Macrofauna, \nFish (Shellfish closures)","x","x","x",null,null,null,null,null,null,null,null,null,null,null,null,null,null,null,null,null,null,"Impacts on marine ecosystems",null,null,null,null,null,null,null,"x",null,null,"P-I relationships? ","NEMO-ERSEM, MEDUSA","N/A","NEMO-ERSEM, MEDUSA","NUE, N footprint, Input-output budget, Exceedance of critical loads of N deposition (natural ecosystem) and critical N inputs (agriculture)","x","x","x","x",null,"x",null,null,null,null,"Critical Load of atmospheric N deposition, Critical input of fertilizer/manure to farmland, Critical level/ratios of N, P, Si in water","x",null,"x","x"]
[3,"Eutrophication in freshwater","Nutrient enrichment of freshwaters and lakes leading to increased algal productivity, cyanobacterial toxins, hypoxia/anoxia and damage to biodiversity","3.1.4","Increased available N in waters","Increased aquatic macrophyte/algal growth","Reduced light penetration / Reduced dissolved oxygen","x",null,null,null,null,"x",null,null,null,null,"x",null,"x",null,null,"x",null,null,null,null,"N-Runoff |\nInputs to water bodies\nN deposition | \nAtmospheric deposition",null,"x",null,"x",null,"x",null,null,"x",null,null,null,null,null,"BOD, \nNO3, \nDissolved O2, \nAlgal taxonomy",null,null,"x",null,null,null,null,null,null,null,null,null,null,null,null,null,null,null,null,null,null,null,null,null,null,null,null,null,"x",null,null,"x","x","x",null,null,null,null,null,null,null,null,null,null,null,"Chlorophyll, \nMacrophytes,  Macrofauna, \nFish yield","x","x","x",null,null,null,null,null,null,null,null,null,null,null,null,null,null,null,null,null,null,"Impacts on freshwater ecosystems",null,null,null,null,null,null,"x",null,null,null,"IMAGE-GLOBIO-aquatic based on P-I relationships\nIMAGE-GNM and Global NEWS (partly)","Aquatic diversity index;  IMAGE-GLOBIO ","ICEP indicator; Global NEWS","N-Runoff; N deposition IMAGE-GLOBIO ","NUE, N footprint, Input-output budget, Exceedance of critical loads of N deposition (natural ecosystem) and critical N inputs (agriculture)","x","x","x",null,null,"x",null,null,null,null,"Critical Load of atmospheric N deposition, Critical input of fertilizer/manure to farmland, Critical level/ratios of N, P, Si in water","x",null,"x","x"]
[4,"Hypoxia/anoxia damage to fisheries","Hypoxia/anoxia, harmful algal blooms in fresh and estuarine waters harm fisheries","3.1.5","Increased available N in waters","Increased aquatic macrophyte/algal growth","Reduced light penetration / Reduced dissolved oxygen","x",null,null,null,null,"x",null,null,null,"x","x","x",null,null,null,null,null,"x",null,null,"N-runoff | Inputs to water bodies \nN deposition | Atmospheric deposition",null,"x",null,"x",null,"x",null,null,"x",null,null,null,null,null,"NO3, dissolved O2, algal taxonomy",null,null,"x",null,null,null,null,null,null,null,null,null,null,null,null,null,null,null,null,null,null,null,null,null,null,null,null,null,"x",null,null,null,"x","x",null,null,null,null,null,null,null,null,null,null,null,"Growth rate of fish\nFish yield","x",null,null,null,"x",null,null,null,null,null,null,null,null,null,null,null,null,null,null,null,null,"Impacts on marine ecosystems",null,null,null,null,null,null,null,"x",null,null,"N/A","NEMO-ERSEM","N/A","NEMO-ERSEM?","NUE, N footprint, Input-output budget","x","x","x",null,null,null,null,null,null,null,"Critical Load of atmospheric N deposition, Critical input of fertilizer/manure to farmland, Critical level/ratios of N, P, Si in water","x",null,"x","x"]
{"$rows_left_out":37}
{"sheet":"Model outputs","index":6,"n_rows":40,"n_cols":12,"rows_kept":40,"cut":false,"hidden":false,"merged":[[1,7,2,7],[1,8,2,8],[1,9,2,9],[1,10,2,10],[1,11,2,11],[1,5,2,5],[1,6,2,6],[1,0,2,0],[1,1,2,1],[1,2,2,2],[1,3,2,3],[1,4,2,4]]}
["Model outputs of A1.5-A2.1 models"]
["Model outputs","IMAGE","MAg-PIE","GLO-BIOM","MI-TERRA","CAPRI","GAINS3","EDGAR","TM5-FASST","EMEP4Earth","Global NEWS","ERSEM-NEMO 4"]
[]
["Drivers of N sources/N fate"]
["·        Energy emissions","X",null,null,null,"X","X","X"]
["·        cropping patterns/ crop areas; ","X","X","X",null,"X"]
["·        herd size/animal numbers","X",null,"X",null,"X"]
["·        Crop production, livestock production","X","X","X",null,"X"]
{"$rows_left_out":33}
{"sheet":"Comments","index":7,"n_rows":2,"n_cols":8,"rows_kept":2,"cut":false,"hidden":false,"merged":[]}
["Sheet name","Raw (optional)","Line (optional)","Cell (optional)","Comments","Name (optional)","Date"]
["Search Indicators",null,null,"C125","\"XXXX\" should be replaced by \"YYYY\"","Hideaki Shibata","2020-07-31","Example"]